{"text_format":"1","workbook":"xlsx","n_sheets":5,"sheets":["RAC2-Adm","RAC2-Campo","PH","CPFxMatricula","PI,CP,CD"],"not_rendered":{"charts":0,"images":1,"macros":1,"external_links":0,"defined_names":3,"comments":0,"pivot_tables":0},"unopened":[],"bounds":{"document_bytes":16777216,"sheet_cells":100000,"rows_first":2000,"rows_last":500,"rows_between":2000,"halvings":0,"cell_chars":16384,"cell_head_chars":4096},"cells_cut":0,"cells_raw":0,"read":"whole","date_system":"1904"}

{"sheet":"RAC2-Adm","index":0,"n_rows":28,"n_cols":8,"rows_kept":28,"cut":false,"hidden":false,"merged":[[1,3,1,7],[3,3,3,7],[25,3,25,7],[27,3,27,6],[5,3,5,5],[6,3,6,5],[15,3,15,7],[16,3,16,7],[11,3,11,7],[14,3,14,7],[19,3,19,7],[21,3,21,7],[22,3,22,7],[24,3,24,7],[8,3,8,7],[9,3,9,6]]}
[]
[null,null,null,"RAC 2 - ADM"]
[]
[null,null,null,"Ative as Macros e preencha somente campos em BRANCO e clique em CALCULAR"]
[]
[null,null,null,"Diária Administrativa Base",null,null,{"$f":"'PI,CP,CD'!B31","v":150.19999999999999}]
[null,null,null,"Diária Administrativa Diretores e Conselheiros",null,null,{"$f":"'PI,CP,CD'!B33","v":201.97}]
[]
[null,null,null,"SELECIONE O TIPO DE DIÁRIA"]
[null,null,null,"Diária Diretores e Conselheiros (SP, RJ ou BSB)",null,null,null,{"$f":"VLOOKUP(D10,'PI,CP,CD'!A30:B33,2,FALSE)","v":262.56100000000004}]
[]
[null,null,null,"DIGITE AS DATAS E HORÁRIOS DA VIAGEM"]
[null,null,null,"DATA DA SAÍDA\nDD/MM/AAAA","HORA DA SAÍDA\nHH:MM","DATA DO RETORNO\nDD/MM/AAAA","HORA DO RETORNO\nHH:MM"]
[null,null,null,"2023-04-18","07:40:00","2023-04-19","21:15:00"]
[null,null,null,"Dias inteiros: 0"]
[null,null,null,"Saída condição 3: Ida até as 12 horas, com pernoite. Diária = 1"]
[null,null,null,"Retorno condição 6: Chegada à origem após as 12 horas. Diária = 1"]
[]
[]
[null,null,null,"CÁLCULOS"]
[]
[null,null,null,"CONDIÇÃO"]
[null,null,null,"Viagem com pernoite. Saída condição 3 e Retorno condição 6."]
[]
[null,null,null,"QUANTIDADE DE DIÁRIAS"]
[null,null,null,2]
[]
[null,null,null,"VALOR TOTAL",null,null,null,{"$f":"D26*H10","v":525.12200000000007}]

{"sheet":"RAC2-Campo","index":1,"n_rows":43,"n_cols":8,"rows_kept":43,"cut":false,"hidden":false,"merged":[[12,3,12,6],[6,3,6,4],[3,3,3,7],[8,3,8,7],[9,3,9,7],[11,3,11,6],[1,3,1,7],[14,3,14,7],[42,3,42,6],[26,3,26,7],[34,3,34,7],[38,3,38,7],[17,3,17,7],[29,3,29,7],[28,3,28,7],[20,3,20,7],[31,3,31,7],[32,3,32,7],[23,3,23,7],[15,3,15,6],[18,3,18,6],[5,3,5,4]]}
[]
[null,null,null,"RAC 2 - CAMPO"]
[]
[null,null,null,"Ative as Macros e preencha somente campos em BRANCO"]
[]
[null,null,null,"Parcela Indenizatória (PI)",null,{"$f":"'PI,CP,CD'!B3","v":121.16}]
[null,null,null,"Unidade Padrão (up)",null,{"$f":"'PI,CP,CD'!B5","v":88.89}]
[]
[null,null,null,"DIGITE O CPF (11 DÍGITOS) OU MATRÍCULA (6 OU 8 DÍGITOS) - SEM PONTOS"]
[]
[]
[null,null,null,"NOME DO EMPREGADO",null,null,null,"PH"]
[null,null,null,{"$f":"IF(LEN(D10)<9,VLOOKUP(LEFT(D10,6),PH!F2:H10000,2,FALSE),VLOOKUP(VLOOKUP(D10,CPFxMatricula!A2:C10000,2,FALSE),PH!F2:H10000,2,FALSE))","v":{"$error":"#N/A"}},null,null,null,{"$f":"IF(LEN(D10)<9,VLOOKUP(LEFT(D10,6),PH!F2:H10000,3,FALSE),VLOOKUP(VLOOKUP(D10,CPFxMatricula!A2:C10000,2,FALSE),PH!F2:H10000,3,FALSE))","v":{"$error":"#N/A"}}]
[]
[null,null,null,"SELECIONE CONDIÇÃO DE DESCONFORTO - CD"]
[null,null,null,"Hospedagem em hotéis e pensões pagos pela empresa, ou em residência de empregado",null,null,null,{"$f":"VLOOKUP(D16,'PI,CP,CD'!A21:B23,2,FALSE)","v":"cd0"}]
[]
[null,null,null,"SELECIONE CONDIÇÃO DE PENOSIDADE - CP"]
[null,null,null,"Trabalhos de campo em: AM, AC, RR, RO, AP, PA, MT, TO e MA",null,null,null,{"$f":"VLOOKUP(D19,'PI,CP,CD'!A25:B28,2,FALSE)","v":"cp3"}]
[]
[null,null,null,"DIGITE AS DATAS E HORÁRIOS DA VIAGEM"]
[null,null,null,"DATA DA SAÍDA\nDD/MM/AAAA","HORA DA SAÍDA\nHH:MM","DATA DO RETORNO\nDD/MM/AAAA","HORA DO RETORNO\nHH:MM","DIAS\n(decimal)"]
[null,null,null,"2023-05-08","08:00:00","2023-05-30","18:00:00",{"$f":"IF(COUNT(D23:G23)<4,\"\",(F23+G23)-(D23+E23))","v":22.416666666664241}]
[null,null,null,{"$f":"IF(MOD(H23,1)<=3/24,\"Quantidade de Diárias: \"&INT(H23),IF(MOD(H23,1)<=15/24,\"Quantidade de Diárias: \"&INT(H23)+0.5,\"Quantidade de Diárias: \"&INT(H23)+1))","v":"Quantidade de Diárias: 22,5"}]
[]
[]
[null,null,null,"CÁLCULOS"]
[]
[null,null,null,"CONDIÇÃO"]
[null,null,null,{"$f":"VLOOKUP(H16&H19,'PI,CP,CD'!A8:B19,2,FALSE)","v":"D"}]
[]
[null,null,null,"QUANTIDADE DE DIÁRIAS"]
[null,null,null,{"$f":"IF(MOD(H23,1)<=3/24,INT(H23),IF(MOD(H23,1)<=15/24,INT(H23)+0.5,INT(H23)+1))","v":22.5}]
[]
[null,null,null,"IC TRIBUTÁVEL"]
[null,null,null,"CP","PH","SUB-TOTAL","QUANTIDADE","TOTAL"]
[null,null,null,{"$f":"VLOOKUP(H19,'PI,CP,CD'!$B$25:$D$28,3,FALSE)","v":53.339999999999996},{"$f":"H13","v":{"$error":"#N/A"}},{"$f":"IFERROR(E37+D37,\"SEM VALOR\")","v":"SEM VALOR"},{"$f":"D33","v":22.5},{"$f":"IFERROR(F37*G37,\"SEM VALOR\")","v":"SEM VALOR"}]
[]
[null,null,null,"IC NÃO TRIBUTÁVEL"]
[null,null,null,"PI","CD","SUB-TOTAL","QUANTIDADE","TOTAL"]
[null,null,null,{"$f":"F6","v":121.16},{"$f":"VLOOKUP(H16,'PI,CP,CD'!$B$21:$D$23,3,FALSE)","v":0},{"$f":"IFERROR(E41+D41,\"SEM VALOR\")","v":121.16},{"$f":"D33","v":22.5},{"$f":"IFERROR(F41*G41,\"SEM VALOR\")","v":2726.1}]
[]
[null,null,null,"VALOR TOTAL",null,null,null,{"$f":"IFERROR(H37+H41,\"SEM VALOR\")","v":"SEM VALOR"}]

{"sheet":"PH","index":2,"n_rows":1502,"n_cols":8,"rows_kept":1502,"cut":false,"hidden":true,"merged":[]}
["Filial","Vinculo","Desc. Vinculo","Desc. Filial","CPF","Matricula","Nome","PH"]
["Filial","Vinculo","Desc. Vinculo","Desc. Filial","CPF","Matricula","Nome","PH"]
["Filial","Vinculo","Desc. Vinculo","Desc. Filial","CPF","Matricula","Nome","PH"]
["Filial","Vinculo","Desc. Vinculo","Desc. Filial","CPF","Matricula","Nome","PH"]
["Filial","Vinculo","Desc. Vinculo","Desc. Filial","CPF","Matricula","Nome","PH"]
["Filial","Vinculo","Desc. Vinculo","Desc. Filial","CPF","Matricula","Nome","PH"]
["Filial","Vinculo","Desc. Vinculo","Desc. Filial","CPF","Matricula","Nome","PH"]
["Filial","Vinculo","Desc. Vinculo","Desc. Filial","CPF","Matricula","Nome","PH"]
["Filial","Vinculo","Desc. Vinculo","Desc. Filial","CPF","Matricula","Nome","PH"]
["Filial","Vinculo","Desc. Vinculo","Desc. Filial","CPF","Matricula","Nome","PH"]
["Filial","Vinculo","Desc. Vinculo","Desc. Filial","CPF","Matricula","Nome","PH"]
["Filial","Vinculo","Desc. Vinculo","Desc. Filial","CPF","Matricula","Nome","PH"]
["Filial","Vinculo","Desc. Vinculo","Desc. Filial","CPF","Matricula","Nome","PH"]
["Filial","Vinculo","Desc. Vinculo","Desc. Filial","CPF","Matricula","Nome","PH"]
["Filial","Vinculo","Desc. Vinculo","Desc. Filial","CPF","Matricula","Nome","PH"]
["130","41","EMPREGADOS","ERJ","010.982.387-70","934194","CARLOS AUGUSTO DE OLIVEIRA TEIXEIRA",163.49]
["130","49","CEDIDOS C ONUS","ERJ","020.486.387-24","922536","CLAUDIA VALERIA RIBEIRO MORANDE",98.37]
["130","41","EMPREGADOS","ERJ","024.209.747-27","812617","MAURICIO MATTOS DOS SANTOS",289.70999999999998]
["130","41","EMPREGADOS","ERJ","025.525.437-74","924946","ANDREA SILVA IGNACIO",111.23]
["130","41","EMPREGADOS","ERJ","035.860.187-89","931136","LUIS CHIAN",167.72]
["130","41","EMPREGADOS","ERJ","042.879.834-91","040762","MARIA AUXILIADORA TAVEIRA BELLO",138.09]
["130","41","EMPREGADOS","ERJ","054.508.047-92","931101","URSULLA BRHENDA TORRES DA FONSECA",210.3]
["130","41","EMPREGADOS","ERJ","069.400.437-56","927601","JANINE MOLINARI MELLO",249.58]
["130","41","EMPREGADOS","ERJ","074.688.177-07","928780","SHEILA TEIXEIRA RIBAMAR",219.61]
["130","41","EMPREGADOS","ERJ","079.504.747-93","928003","EMILIA HAMAM DE FIGUEIREDO",189.48]
["130","41","EMPREGADOS","ERJ","085.331.767-40","929654","PATRICIA DOS SANTOS ALVERNAZ DE AZEVEDO",276.39]
["130","41","EMPREGADOS","ERJ","091.259.047-52","929239","FATIMA BRITO MORAES",189.48]
["130","41","EMPREGADOS","ERJ","108.339.297-20","811912","JULIANA MACEIRA MORAES",258.68]
["130","41","EMPREGADOS","ERJ","420.118.767-53","227587","ADONIAS GOMES DO CARMO",118.75]
["130","41","EMPREGADOS","ERJ","447.726.297-34","223271","NELSON BRAZ DE JESUS NEVES",124.76]
["130","41","EMPREGADOS","ERJ","539.537.387-04","710130","PAULO RICARDO ALMEIDA SAMPAIO",124.76]
["130","41","EMPREGADOS","ERJ","547.380.247-87","715093","ANA RITA NUNES MELGACO",119.78]
["130","41","EMPREGADOS","ERJ","695.185.487-49","930083","RUBENS ESTEVES KENUP",189.48]
["130","41","EMPREGADOS","ERJ","705.403.227-68","924962","CARLOS AFONSO CUNHA AVILA",108.51]
["130","41","EMPREGADOS","ERJ","775.296.007-10","712108","JOSEANE ALVES LADEIRA",129]
["130","41","EMPREGADOS","ERJ","822.701.637-53","718394","AMERICO DOS SANTOS JUNIOR",317.75]
["130","41","EMPREGADOS","ERJ","845.964.657-20","922846","ANGELO REIS GIADA",229.33]
["130","41","EMPREGADOS","ERJ","016.232.117-19","931012","JULIO FERNANDES LIMA",288.47000000000003]
["130","41","EMPREGADOS","ERJ","022.201.061-44","162949","DEBORA RABELO MATOS",241.96]
["130","41","EMPREGADOS","ERJ","036.249.461-45","934712","JESSICA DOS SANTOS GONCALVES",266.12]
["130","41","EMPREGADOS","ERJ","043.925.487-67","928020","VINICIUS DOS SANTOS BARRETO",225.1]
["130","41","EMPREGADOS","ERJ","105.028.357-02","930989","PAMELA LOURENCO DE SOUZA REYNALDO",115.46]
["130","41","EMPREGADOS","ERJ","117.925.127-08","806242","RAFAEL CORREA DE MELO",241.96]
["130","41","EMPREGADOS","ERJ","271.513.017-15","209821","CLEUSA SOARES BURMEISTER",334.99]
["130","41","EMPREGADOS","ERJ","348.593.067-91","718327","LAURA MARIA RIGONI DIAS",189.27]
["130","41","EMPREGADOS","ERJ","369.738.518-60","934585","LUCIANA SALGADO DE OLIVEIRA",220.27]
["130","41","EMPREGADOS","ERJ","436.470.731-72","718378","EDGAR SHINZATO",353.43]
["130","41","EMPREGADOS","ERJ","682.631.717-68","710920","LIDIA MARIA PINTO",137.71]
["130","41","EMPREGADOS","ERJ","743.589.367-68","713686","LAERTE XAVIER DOS SANTOS",95.14]
["130","41","EMPREGADOS","ERJ","767.651.307-30","713724","JOSE ALMIR MOREIRA DA SILVA",69.97]
["130","41","EMPREGADOS","ERJ","797.264.617-15","923052","REGILENE COUTINHO DE SOUZA",265.20999999999998]
["130","41","EMPREGADOS","ERJ","869.275.584-20","821802","SUZY KUMMER DA ROCHA",230.73]
["130","41","EMPREGADOS","ERJ","883.313.507-15","718670","RICARDO LUIZ BARREIROS MOTTA",312.51]
["130","41","EMPREGADOS","ERJ","923.529.367-72","719099","WALMAR DE ABREU",288.47000000000003]
["130","31","LIVRE PROVIMENTO","ERJ","994.073.027-68","932663","CLAUDIA MAURICIO BARROS",189.27]
["130","41","EMPREGADOS","ERJ","010.810.537-71","927457","ADRIANA DANTAS MEDEIROS",247.4]
["130","41","EMPREGADOS","ERJ","010.958.557-78","717088","ROSEMERE DOS SANTOS BRASIL",116.86]
["130","41","EMPREGADOS","ERJ","023.964.637-13","922862","MARCELO EDUARDO DANTAS",323.66000000000003]
["130","41","EMPREGADOS","ERJ","080.905.927-40","928411","VANESSA SOARES FRANCISCO",289.70999999999998]
["130","41","EMPREGADOS","ERJ","084.945.376-36","885525","GIANA GRUPIONI REZENDE",208.5]
["130","41","EMPREGADOS","ERJ","090.370.417-01","928305","LURI KOIWAI",251]
["130","41","EMPREGADOS","ERJ","097.752.587-23","927864","GABRIEL MUNIZ MAZZONI",118.24]
["130","41","EMPREGADOS","ERJ","106.515.677-42","866407","RAFAEL SILVA RIBEIRO",252.45]
["130","41","EMPREGADOS","ERJ","118.816.697-26","931063","CIRO PEREIRA TEIXEIRA MESSIAS",91.34]
["130","41","EMPREGADOS","ERJ","122.284.318-85","928437","ANDRE LUIS INVERNIZZI",247.4]
["130","41","EMPREGADOS","ERJ","345.960.387-91","217611","IVAN SOARES DOS SANTOS",124.76]
["130","41","EMPREGADOS","ERJ","368.975.598-06","934348","VADIM HARLAMOV",155.61000000000001]
["130","41","EMPREGADOS","ERJ","473.940.487-72","223263","JAIR DE SOUZA",118.75]
["130","41","EMPREGADOS","ERJ","510.142.627-04","922269","EDILZA FERREIRA DE ALCANTARA",119.78]
["130","41","EMPREGADOS","ERJ","580.660.127-72","226688","ROSANE MARTINS SANTOS MOREIRA",137.71]
["130","41","EMPREGADOS","ERJ","712.845.407-15","719234","IRENE CRISTINA CORREA REIS",114.01]
["130","31","LIVRE PROVIMENTO","ERJ","726.209.941-87","937690","ANDRE LEITE CABRAL",210.3]
["130","41","EMPREGADOS","ERJ","746.177.617-72","713791","JOSE ANTONIO SALES DA COSTA",124.76]
["130","41","EMPREGADOS","ERJ","898.358.677-04","930741","MARCELO PARENTE HENRIQUES",192.34]
["130","41","EMPREGADOS","ERJ","011.393.087-93","821489","AMARO LUIZ FERREIRA",364.77]
["130","41","EMPREGADOS","ERJ","020.540.957-10","929549","SAMANTA BITTENCOURT SUPRANI",189.27]
["130","41","EMPREGADOS","ERJ","072.145.576-06","866580","IZABELA DUARTE GIFFONI",266.12]
["130","41","EMPREGADOS","ERJ","074.858.317-39","928011","FERNANDO GONCALVES RELVAS NETO",189.48]
["130","41","EMPREGADOS","ERJ","111.036.803-82","228087","EUGENIO SOUSA",121.72]
["130","41","EMPREGADOS","ERJ","417.820.117-49","226211","CHIRLEY XAVIER RODRIGUES LAMANA",144.68]
["130","41","EMPREGADOS","ERJ","435.874.027-87","710431","DECIO RODRIGUES GOULART",134.35]
["130","41","EMPREGADOS","ERJ","468.187.077-34","923371","MARGARETH LOPES DE MORAES",225.1]
["130","41","EMPREGADOS","ERJ","485.107.777-72","927414","ALVARO GOMES SOBRAL BARCELLOS",252.97]
["130","41","EMPREGADOS","ERJ","528.446.257-20","228737","VALERIA PINTO DE OLIVEIRA",205.08]
["130","41","EMPREGADOS","ERJ","544.566.497-04","226041","MARIA DA CONCEICAO SEIXAS MOTA",134.35]
["130","41","EMPREGADOS","ERJ","672.086.737-72","922731","EMILIA CRISTINA MOREIRA MEZAVILLA",311.56]
["130","31","LIVRE PROVIMENTO","ERJ","860.818.457-53","936227","MARCELO PACHECO ZOEL",210.3]
["130","41","EMPREGADOS","ERJ","025.342.055-52","636142","VICTOR AUGUSTO HILQUIAS SILVA ALVES",241.96]
["130","41","EMPREGADOS","ERJ","042.908.936-86","636215","ALBERTO FRANCO LACERDA",159.5]
["130","41","EMPREGADOS","ERJ","042.968.757-52","931284","DANIEL MEDEIROS MOREIRA",260.07]
["130","41","EMPREGADOS","ERJ","095.210.287-00","929131","MARIANA DIAS VILLAS BOAS",293.33]
["130","41","EMPREGADOS","ERJ","096.984.987-70","930750","THIAGO DUTRA DOS SANTOS",252.97]
["130","41","EMPREGADOS","ERJ","106.861.167-71","934844","DIEGO PANAZIO ZEITUNE",272.43]
["130","41","EMPREGADOS","ERJ","120.226.107-84","935387","MARCIO VINICIUS DE QUEIROZ SANTOS",244.75]
["130","41","EMPREGADOS","ERJ","130.363.308-60","928721","ANDREA SUMIE WADAMORI",189.48]
["130","41","EMPREGADOS","ERJ","309.905.487-91","214531","ADENIR LORDES",58.9]
["130","41","EMPREGADOS","ERJ","330.659.857-72","924890","MARIA FERNANDA CORREIA MASCARENHAS",199.07]
["130","41","EMPREGADOS","ERJ","454.881.507-49","224065","ANGELA DE OLIVEIRA",121.72]
["130","41","EMPREGADOS","ERJ","606.226.877-00","821217","LEDA MARIA BARRETO FRAGA",376.93]
["130","41","EMPREGADOS","ERJ","765.303.457-87","317527","ELVIS MARTINS DE OLIVEIRA",247.4]
["130","41","EMPREGADOS","ERJ","775.569.417-87","713287","ILMA THOMAZ DE AQUINO",54.77]
["130","41","EMPREGADOS","ERJ","813.516.587-00","717002","REGINA FATIMA DA CONCEICAO SIEBRA",324.77999999999997]
["130","41","EMPREGADOS","ERJ","838.196.817-87","928551","ADRIANA GOMES DE SOUZA",252.97]
["130","41","EMPREGADOS","ERJ","844.487.177-04","928747","ADRIANA DA SILVA GONCALVES",189.48]
["130","41","EMPREGADOS","ERJ","886.763.667-72","931047","DENISE PIMENTEL DE ASSIS",222.59]
["130","41","EMPREGADOS","ERJ","003.160.537-08","822639","CRISTINA MIRANDA AZEVEDO",159.5]
["130","41","EMPREGADOS","ERJ","018.639.667-81","930814","JULIANA STEWART FERRAZ",219.61]
["130","31","LIVRE PROVIMENTO","ERJ","044.514.577-34","934071","DIOGENES DE ALMEIDA CAMPOS",210.3]
["130","41","EMPREGADOS","ERJ","048.183.964-00","934593","RENATA BEZERRA E SILVA DE ARAUJO",209.34]
["130","41","EMPREGADOS","ERJ","054.050.297-93","929417","LUIZ FERNANDO REZZANO FERNANDES",116.86]
["130","41","EMPREGADOS","ERJ","055.334.427-74","930768","REJANE DE AZEVEDO COQUERO",276.39]
["130","41","EMPREGADOS","ERJ","079.411.637-05","930342","MARCIO JUNGER RIBEIRO",111.23]
["130","41","EMPREGADOS","ERJ","091.099.467-64","934232","FLAVIO AUGUSTO DE SOUZA PINHEIRO",254.96]
["130","41","EMPREGADOS","ERJ","123.110.197-08","852139","RODOLFO REIS DE PAULA",241.96]
["130","41","EMPREGADOS","ERJ","219.050.248-94","863793","MARCO AURELIO PIACENTINI PINHEIRO",299.79000000000002]
["130","41","EMPREGADOS","ERJ","270.228.387-04","206776","MARIA JOSE CABRAL CEZAR",351.81]
["130","41","EMPREGADOS","ERJ","344.230.957-34","216577","LUCIA REGIA ARAUJO FREITAS",258.8]
["130","41","EMPREGADOS","ERJ","398.617.888-08","813362","LEONARDO BRENGUERE LEAO LOPES",207.55]
["130","41","EMPREGADOS","ERJ","631.291.670-72","884430","JULIANO DE SOUZA OLIVEIRA",374.69]
["130","41","EMPREGADOS","ERJ","715.820.707-25","711217","MARCO ANTONIO DE SOUZA",82.09]
{"$rows_left_out":1383}
{"sheet":"CPFxMatricula","index":3,"n_rows":1719,"n_cols":3,"rows_kept":1719,"cut":false,"hidden":true,"merged":[]}
["CPF","Matricula","Nome"]
[1921428287,"010481","ABRAAO FERNANDO FIGUEIRA DE MELO"]
[76731472620,"863831","ADAILSO BENTO FIGUEIREDO"]
[13223275304,"840050","ADAO JOSE GOMES"]
[42103983300,"842729","ADEMAR GONCALVES LIMA"]
[55592350597,"925802","ADEMI DOS SANTOS"]
[19945280600,"302651","ADEMIR DA ROCHA"]
[30990548791,"214531","ADENIR LORDES"]
[48538582453,"803618","ADEVANIA LOPES FONSECA"]
[28169310300,"317403","ADINANCI MORAIS COSTA"]
[36146546801,"813427","ADOLFO BARBOSA DA SILVA"]
[42783542668,"813982","ADOLFO REGINALDO JERONIMO"]
[42011876753,"227587","ADONIAS GOMES DO CARMO"]
[19024172837,"807176","ADRIANA BAGGIO GARLIPP"]
[68898100906,"317179","ADRIANA BURIN WESCHENFELDER"]
[84448717704,"928747","ADRIANA DA SILVA GONCALVES"]
[1081053771,"927457","ADRIANA DANTAS MEDEIROS"]
[83819681787,"928551","ADRIANA GOMES DE SOUZA"]
[9716774761,"929646","ADRIANA JULIAO RIBEIRO"]
[54187184449,"803430","ADRIANO DA SILVA SANTOS"]
[65244001000,"884464","ADRIANO DE SOUZA SCHORR"]
[35200863449,"841501","ADSON BRITO MONTEIRO"]
[13780522420,"804126","AERTON ZAMBONI MAIA"]
[33570728234,"821365","AFONSO NORMANDO TRINDADE"]
[7410670487,"122718","AFRANIO DA CUNHA MACEDO"]
[1054115745,"930717","ALAN DUSSEL SCHIROS"]
[825148286,"852597","ALAN FELIPE PROGENIO DO AMARAL SOUSA"]
[79398863553,"130014","ALAN FRAGA OLIVEIRA"]
[901575402,"805092","ALAN PEREIRA DA COSTA"]
[5249509975,"813320","ALBERT TEIXEIRA CARDOSO"]
[12338842120,"317004","ALBERTO BRAIS BORGES"]
[14912643149,"421146","ALBERTO COSTA DE OLIVEIRA"]
[4290893686,"636215","ALBERTO FRANCO LACERDA"]
[32274092400,"806374","ALBERTO RICARDO TORRES GALVAO NETO"]
[79678165520,"636371","ALBERTO SANTOS MOREIRA JUNIOR"]
[56367520163,"161926","ALCELIO FERREIRA LIMA"]
[30278996434,"795194","ALCEMIR DA SILVA"]
[7406718713,"930288","ALCEU PERCY MENDEL JUNIOR"]
[5225307299,"852791","ALCINDO DE JESUS RODRIGUES TEIXEIRA"]
[74914642700,"922099","ALDA MARIA FERREIRA ROSA DA SILVA"]
[13679392249,"754145","ALDERAN ANTONIO SOUZA"]
[21703622820,"812471","ALDREI MARUCCI VEIGA"]
[5028875910,"635413","ALESSANDRA ELISA BLASKOWSKI"]
[43181759015,"863246","ALESSANDRA LUIZA RAHEL"]
[1855995751,"719048","ALESSANDRA MARCIA GOMES CANDIDO"]
[80906214904,"929085","ALESSANDRA PACHECO CARDOSO MOREIRA"]
[94246254134,"812111","ALESSANDRA PATRICIA DINIZ GALIMBERTI"]
[7208883793,"864129","ALESSANDRO ALBUQUERQUE DE OLIVEIRA"]
[99394863672,"862037","ALESSANDRO JOSE DA SILVA"]
[82544050349,"317624","ALEX FRANCA LIMA"]
[8905018742,"930911","ALEXANDRA DE ABREU MARQUES COENTRAO DE MARINS"]
[9708775797,"822370","ALEXANDRE ALVES DE OLIVEIRA"]
[73819034749,"713392","ALEXANDRE CARLOS DA SILVA"]
[38805014753,"759040","ALEXANDRE DIAS CARVALHO"]
[58742042704,"929492","ALEXANDRE FERNANDES SILVA"]
[94513414049,"864137","ALEXANDRE HENRIQUE"]
[37338005249,"927473","ALEXANDRE LISBOA LAGO"]
[3749084785,"931055","ALEXANDRE LUIS DE AZEVEDO SANTOS"]
[82209308453,"804631","ALEXANDRE LUIZ SOUZA BORBA"]
[65439031391,"866563","ALEXANDRE MORAIS DOS SANTOS"]
[8940009770,"928160","ALEXANDRE OLIVEIRA DE SOUZA JUNIOR"]
[3123290409,"805050","ALEXANDRE RANIER DANTAS"]
[31585329053,"886271","ALEXANDRE RITTER VOLKMANN"]
[45647313000,"884103","ALEXANDRE SILVA NOGUEIRA"]
[8603313857,"891312","ALEXANDRE TADINI CRUZ"]
[2908286785,"884081","ALEXANDRE TREVISAN CHAGAS"]
[32815883368,"841145","ALEXEY ATAIDE PEIXOTO"]
[50878387234,"317683","ALEXSANDRE ONOFRE DE LIMA"]
[37026602837,"842885","ALICE ALVES DA SILVA"]
[22972285204,"821594","ALICE MARIA COSTA DO NASCIMENTO AMORIM"]
[66410177615,"885185","ALICE SILVA DE CASTILHO"]
[75112469234,"842460","ALINE CARLA DE PINA BARROS"]
[5756773762,"634921","ALINE DA COSTA NOGUEIRA"]
[39815702866,"892297","ALINE DA SILVA GARCIA"]
[7198143407,"318370","ALINE DA SILVA PRADO"]
[77007999204,"317730","ALISSON AUGUSTO SILVA DE ALMEIDA"]
[7294722641,"864552","ALISSON SANTOS AMORIM"]
[9212124291,"752380","ALMIR ARAUJO PACHECO"]
[17558956404,"597864","ALMIR GOMES FREIRE"]
[898601525,"634514","ALOISIO DA SILVA PIRES"]
[12557129100,"428116","ALTAIR HONORIO DA SILVA"]
[53065301172,"811530","ALUISIO CALISTA DE ALENCAR FILHO"]
[3114158307,"842419","ALVARO ANDRE VON GLEHN DOS SANTOS"]
[9490720607,"866474","ALVARO CESAR ELIAS MENDES"]
[48510777772,"927414","ALVARO GOMES SOBRAL BARCELLOS"]
[81486731287,"318019","ALZIRA BARROS CARDOSO"]
[2927578249,"330744","AMADEU DA SILVA BARBOSA"]
[2136807269,"852813","AMANDA CAROLINE DA SILVA PINHO"]
[11763970604,"886459","AMANDA CORREA DE MORAIS COSTA"]
[18228549709,"937916","AMANDA CRISTINA SILVA DA ROSA"]
[1883994101,"935841","AMANDA DE OLIVEIRA TODESCHINI"]
[3542677523,"637025","AMANDA DE SOUSA ANDRADE"]
[11480248754,"937517","AMANDA FATIMA ALMEIDA PAULO DA SILVA"]
[10137391757,"937967","AMANDA PAULA DA SILVA"]
[8972329681,"864099","AMANDA SANTOS SOCORRO FIGUEIREDO"]
[1139308793,"821489","AMARO LUIZ FERREIRA"]
[83238670700,"929557","AMERICO CAIADO PINTO"]
[82270163753,"718394","AMERICO DOS SANTOS JUNIOR"]
[12017078034,"010511","AMILCAR ADAMY"]
[31935427504,"632911","AMILTON DE AMORIM BENICIO"]
[12403954500,"634174","AMILTON DE CASTRO CARDOSO"]
[50326121897,"892505","ANA BEATRIZ DA SILVA RIBEIRO"]
[14954031737,"937991","ANA BEATRIZ FERREIRA DE OLIVEI"]
[295040238,"852848","ANA CAROLINA XAVIER REIS"]
[93664613015,"317136","ANA CAROLINA ZOPPAS COSTI"]
[3320207547,"852228","ANA CAROLINE SANTOS PARANHOS"]
[1608327647,"867594","ANA CLARA DA CRUZ PIRES"]
[47242019400,"803553","ANA CLAUDIA DE AGUIAR ACCIOLY"]
[64590488000,"882607","ANA CLAUDIA VIERO"]
[2945200589,"885231","ANA CRISTINA BOMFIM PEIXOTO"]
[85667226715,"130012","ANA CRISTINA FIGUEIREDO MENDES"]
[60748524720,"713716","ANA IRIS MARTINS MORAES RIBA"]
[50992392004,"882399","ANA LUCIA BORGES FORTES COELHO"]
[92790275734,"130001","ANA LUCIA PISSURNO"]
[14496637618,"867675","ANA LUIZA REIS SILVA"]
[50910280053,"882496","ANA MARIA BARRETO DOS SANTOS MARIA"]
[41981758704,"229105","ANA MARIA BRITO DA SILVA"]
[2151802590,"885207","ANA PAULA ALVES SANTANA"]
[11045465747,"929875","ANA PAULA BRAGA PETITO"]
[27163530854,"842648","ANA PAULA DA SILVA"]
{"$rows_left_out":1600}
{"sheet":"PI,CP,CD","index":4,"n_rows":33,"n_cols":4,"rows_kept":33,"cut":false,"hidden":true,"merged":[]}
["Planilha Auxiliar"]
[]
["Parcela Indenizatória (PI)",121.16]
[]
["Unididade Padrão (up)",88.89]
[]
["Combinação","Tipo"]
["cd0cp0","A"]
["cd0cp1","B"]
["cd0cp2","C"]
["cd0cp3","D"]
["cd1cp0","E"]
["cd1cp1","F"]
["cd1cp2","G"]
["cd1cp3","H"]
["cd2cp0","I"]
["cd2cp1","J"]
["cd2cp2","K"]
["cd2cp3","L"]
[]
["Hospedagem em hotéis e pensões pagos pela empresa, ou em residência de empregado","cd0",0,{"$f":"ROUNDUP(C21*$B$5,2)","v":0}]
["Pernoites em acampamentos fixos mantidos pela empresa para atendimento específico ao projeto","cd1",0.2,{"$f":"ROUNDUP(C22*$B$5,2)","v":17.78}]
["Pernoites em acampamentos móveis, embarcações ou veículos","cd2",0.4,{"$f":"ROUNDUP(C23*$B$5,2)","v":35.559999999999995}]
[]
["Trabalhos de campo em regiões metropolitanas e no DF","cp0",0,{"$f":"ROUNDUP(C25*$B$5,2)","v":0}]
["Trabalhos de campo em: RS, SC, PR, SP, RJ, ES, MG, MS e GO","cp1",0.2,{"$f":"ROUNDUP(C26*$B$5,2)","v":17.78}]
["Trabalhos de campo em: PI, CE, RN, PB, PE, AL, SE e BA","cp2",0.4,{"$f":"ROUNDUP(C27*$B$5,2)","v":35.559999999999995}]
["Trabalhos de campo em: AM, AC, RR, RO, AP, PA, MT, TO e MA","cp3",0.6,{"$f":"ROUNDUP(C28*$B$5,2)","v":53.339999999999996}]
[]
["Diária Empregados (SP, RJ ou BSB)",{"$f":"+B31*1.3","v":195.26}]
["Diária Empregados (Demais Cidades)",150.19999999999999]
["Diária Diretores e Conselheiros (SP, RJ ou BSB)",{"$f":"B33*1.3","v":262.56100000000004}]
["Diária Diretores e Conselheiros (Demais Cidades)",201.97]